پر پایان
scope note: گروهی از شکم پایان پلاژیک که دارای صدف ظریف آهکی مخروطی می باشند
broader: شکم‌پایان
preferred label: Pteropoda @en
type: Concept

شکم‌پایان
preferred label: Gastropoda @en
type: Concept
narrower: پر پایان