بندر گریز
scope note: شاخابه فرعی اقیانوس آرام در جنوب غرب ساحل ناحیه گریزهاربور، واشنگتن.
related: ناحیه گریزهاربور واشنگتن
related: واشنگتن
preferred label: Grays Harbor @en
type: Concept

واشنگتن
preferred label: Washington @en
type: Concept
related: بندر گریز

ناحیه گریزهاربور واشنگتن
preferred label: Grays Harbor County Washington @en
type: Concept
related: بندر گریز