شیشه آتشفشانی
preferred label: volcanic glass @en
type: Concept
related: بلورک

ماگما
preferred label: magma @en
type: Concept
related: بلورک

بلورک
scope note: جسم بسیار ریزی با ترکیب کانی‏شناختی نامشخص که شکل بلوری آن کامل نشده باشد و نور را قطبیده نکند؛ این اجسام نشان‏دهندۀ مرحلۀ آغازین بلوری شدن ماگما یا شیشه هستند
related: شیشه آتشفشانی
related: ماگما
preferred label: crystallite @en
type: Concept