بلورپروری
scope note: شاخه‏ای از بلورنگاری که با پرورش بلور سروکار داشته باشد
related: بلورنگاری
related: بلور
preferred label: crystallogeny @en
type: Concept

بلور
preferred label: crystal @en
type: Concept
related: بلورپروری

بلورنگاری
preferred label: crystallography @en
type: Concept
related: بلورپروری