بلور
preferred label: crystal @en
type: Concept
narrower: بلورهای پستانی

بلورهای پستانی
scope note: توده‌های گرد بزرگ به شکل پستان که از تک‌بلورهای شعاعی ساخته شده‌اند
broader: بلور
preferred label: mammillary crystals @en
type: Concept