بلورهای ستاره‌ای
scope note: تک‌بلورهای شعاعی که به‌صورت ستاره یا دایره در کنار هم قرار می‌گیرند
broader: بلور
preferred label: stellated crystals @en
type: Concept

بلور
preferred label: crystal @en
type: Concept
narrower: بلورهای ستاره‌ای