بلورهای شاخه‌ای
scope note: بلورهای بلند کشیده که مانند درخت شاخه‌شاخه می‌شوند
broader: بلور
preferred label: dendritic crystals @en
type: Concept

بلور
preferred label: crystal @en
type: Concept
narrower: بلورهای شاخه‌ای