بلورهای قشری
scope note: انبوهه‌ای از بلورهای ریز که یک سطح را می‌پوشانند
broader: بلور
preferred label: drusy crystals @en
type: Concept

بلور
preferred label: crystal @en
type: Concept
narrower: بلورهای قشری