بلورهای هم‌مرکز
scope note: لایه‌های تقریباً کروی دارای یک مرکز مشترک
broader: بلور
preferred label: concentric crystals @en
type: Concept

بلور
preferred label: crystal @en
type: Concept
narrower: بلورهای هم‌مرکز