برنامه نیر
scope note: اولین ماموریت طرح اکتشافی ناسا که در سال 1990 برای گردش دور میدان 433، سیارک اروس طراحی شده بود.
related: سیارک اروس
related: سیارک
preferred label: NEAR Program @en
type: Concept

سیارک
preferred label: asteroid @en
type: Concept
related: برنامه نیر

سیارک اروس
preferred label: Eros Asteroid @en
type: Concept
related: برنامه نیر