برون‌رَست
preferred label: exsolution @en
type: Concept
related: بافت برون‌رَستی

بافت
preferred label: texture @en
type: Concept
narrower: بافت برون‌رَستی

بافت برون‌رَستی
scope note: بافت هر انبوهۀ کانیایی یا درهم‌رشدی که براثر برون‌رَست تشکیل شده است
related: برون‌رَست
broader: بافت
preferred label: exsolution texture @en
type: Concept