بافت پوست‌ماری
scope note: بافتی آذرین با بلورهای الواری پلاژیوکلاز که با دانه‌های پیروکسن احاطه شده است
related: سنگ آذرین
broader: بافت
preferred label: ophitic texture @en
type: Concept

بافت
preferred label: texture @en
type: Concept
narrower: بافت پوست‌ماری

سنگ آذرین
preferred label: igneous rock @en
type: Concept
related: بافت پوست‌ماری