بافت دانه‌ای خودریخت
scope note: بافت آذرین ویدایی که بخش اعظم آن از دانه‌های هم‌اندازۀ خوش‌وجه تشکیل شده است
broader: بافت دانه‌ای
preferred label: idiomorphic-granular texture @en
type: Concept

بافت دانه‌ای
preferred label: granular texture @en
type: Concept
narrower: بافت دانه‌ای خودریخت