بافت
preferred label: texture @en
type: Concept
narrower: بافت ضربدری

بافت ضربدری
scope note: ریزبافتی در سنگ‌های دگرگونی که در آن بلورهای هم‌جوار به‌صورت نامنظم و در جهت‌های متقاطع قرار گرفته‌اند
related: سنگ دگرگونی
broader: بافت
preferred label: decussate texture @en
type: Concept

سنگ دگرگونی
preferred label: metamorphic rock @en
type: Concept
related: بافت ضربدری