بافت نهان بلوری
alternative label: بافت ناویدا
scope note: بافتی در سنگ‌های آذرین با دانه‏های بسیار ریز که با چشم غیرمسلح دیده نمی‏شود.
related: سنگ آذرین
broader: بافت
preferred label: aphanitic texture @en
type: Concept

بافت
preferred label: texture @en
type: Concept
narrower: بافت نهان بلوری

سنگ آذرین
preferred label: igneous rock @en
type: Concept
related: بافت نهان بلوری