کوردوفان
alternative label: کوردوفان سودان
scope note: ناحیه‌ای در مرکز سودان. ایالت بزرگ قدیمی.
broader: سودان
preferred label: Kordofan @en
type: Concept

سودان
preferred label: Sudan @en
type: Concept
narrower: کوردوفان