ماپوتو موزامبیک
scope note: نامی جدید برای شهر لورنسومارکوس که در خلیج دلاگوا واقع شده است در جنوب موزامبیک.
broader: آفریقای شرقی
preferred label: Maputo Mozambique @en
type: Concept

آفریقای شرقی
preferred label: East Africa @en
type: Concept
narrower: ماپوتو موزامبیک