گودال فایوم
scope note: بستر دریاچه قدیمی موریس در شمال مصر علیا جنوب غرب قاهره.
broader: مصر
preferred label: Fayum Depression @en
type: Concept

مصر
preferred label: Egypt @en
type: Concept
narrower: گودال فایوم