جزایر فیلیپین
preferred label: Philippine Islands @en
type: Concept
narrower: پالاوان

پالاوان
scope note: جزیره باریک و درازی مابین شمال بورنئو و غرب فیلیپین
broader: جزایر فیلیپین
preferred label: Palawan @en
type: Concept