آتشفشان
preferred label: volcano @en
type: Concept
related: کوه پنیاتوبو

کوه پنیاتوبو
scope note: آتشفشانی در جنوب شرق لوزون، شمال شرق جزایر فیلیپین. فوران جدید نوع پلنین.
related: آتشفشان
broader: لوزون
preferred label: Mount Pinatubo @en
type: Concept

لوزون
preferred label: Luzon @en
type: Concept
narrower: کوه پنیاتوبو