آتشفشان
preferred label: volcano @en
type: Concept
related: مایون

لوزون
preferred label: Luzon @en
type: Concept
narrower: مایون

مایون
scope note: مخروط آتشفشانی. ایالت آلبی، جنوب شرق لوزون. خاور دور.
related: آتشفشان
broader: لوزون
preferred label: Mayon @en
type: Concept