جزایر فیلیپین
preferred label: Philippine Islands @en
type: Concept
narrower: میندانائو

میندانائو
scope note: دومین جزیره بزرگ و جنوبی ترین جزیره بزرگ جزایر فیلیپن.
broader: جزایر فیلیپین
preferred label: Mindanao @en
type: Concept