هاکودات ژاپن
scope note: شهری در تنگه تسوگارو در ایالت کوچک اوشیما، جنوب غرب هوکایدو.
broader: هوکایدو
preferred label: Hakodate Japan @en
type: Concept

هوکایدو
preferred label: Hokkaido @en
type: Concept
narrower: هاکودات ژاپن