رودخانه یاهاگی
scope note: به خلیج چیتا در اقیانوس آرام، جنوب ناگویا در مرکز هونشو می‌ریزد
related: گیفو ژاپن
broader: هونشو
preferred label: Yahagi River @en
type: Concept

هونشو
preferred label: Honshu @en
type: Concept
narrower: رودخانه یاهاگی

گیفو ژاپن
preferred label: Gifu Japan @en
type: Concept
related: رودخانه یاهاگی