کمربند ریوک
scope note: کمربند دگرگونی ناحیه میدوی مابین یوکوهوما و ناگویا
broader: هونشو
preferred label: Ryoke Belt @en
type: Concept

هونشو
preferred label: Honshu @en
type: Concept
narrower: کمربند ریوک