ترکیه
preferred label: Turkey @en
type: Concept
narrower: آنتالیا ترکیه

آنتالیا ترکیه
alternative label: آدالیا ترکیه
scope note: ایالتی در جنوب آناتولی روی خلیج آدالیا همچنین نام شهری قدیمی که سابقا آدالیا نامیده می شد
related: آناتولی
broader: ترکیه
preferred label: Antalya Turkey @en
type: Concept

آناتولی
preferred label: Anatolia @en
type: Concept
related: آنتالیا ترکیه