عجمان
scope note: یکی از فدراسیون‌های هفت ایالت در انتهای جنوبی خلیج فارس
broader: شبه جزیره عربی
preferred label: Ajman @en
type: Concept

شبه جزیره عربی
preferred label: Arabian Peninsula @en
type: Concept
narrower: عجمان