لوگار افغانستان
scope note: برای ایالتی در شرق افغانستان استفاده می شود.
broader: افغانستان
preferred label: Logar Afghanistan @en
type: Concept

افغانستان
preferred label: Afghanistan @en
type: Concept
narrower: لوگار افغانستان