ناگپور هند
scope note: شهر، بخش و ناحیه ای در شما ل شرق ماهاراشترا، غرب مرکز هند.
broader: ماهاراشترا هند
preferred label: Nagpur India @en
type: Concept

ماهاراشترا هند
preferred label: Maharashtra India @en
type: Concept
narrower: ناگپور هند