زمین‌شناسی عمومی
preferred label: popular geology @en
type: Concept
related: آتلانتیس

آتلانتیس
scope note: جزایر راهنما یا خشکی هایی که گفته می شود که توسط یک سیل از بین رفته اند.
related: زمین‌شناسی عمومی
preferred label: Atlantis @en
type: Concept