آتشفشان
preferred label: volcano @en
type: Concept
narrower: آتشفشان منقرض

آتشفشان منقرض
scope note: آتشفشانی که در حال حاضر فوران نمی‏کند و احتمال فوران آن در آینده نیز وجود ندارد
broader: آتشفشان
preferred label: extinct volcano @en
type: Concept