ایزفسیل
preferred label: ichnofossil @en
type: Concept
related: ایزگان

ایزگان
scope note: مجموعه‌ای از ایزفسیل‌های یافت‌شده از زیست‌بومی واحد
related: ایزفسیل
preferred label: ichnocoenosis @en
type: Concept