توپوگرافی
preferred label: topography @en
type: Concept
related: ایالت ریخت‌نگاری

زمین‌ریخت‌شناسی
preferred label: geomorphology @en
type: Concept
related: ایالت ریخت‌نگاری

ایالت ریخت‌نگاری
alternative label: ایالت چهرنگاشتی
scope note: ناحیه‌ای که در آن همۀ بخش‌ها ازنظر ساختار زمین‌شناختی و اقلیم شبیه به‌ هم هستند و تاریخچۀ زمین‌ریختی یکسانی دارند.
related: توپوگرافی
related: زمین‌ریخت‌شناسی
preferred label: physiographic province @en
type: Concept