اوکلاهما
preferred label: Oklahoma @en
type: Concept
narrower: وودوارد اوکلاهما

وودوارد اوکلاهما
scope note: شهری درکناره رود کانادایی شمالی در شمال غرب اوکلاهما
broader: اوکلاهما
preferred label: Woodward Oklahoma @en
type: Concept