ناحیه لیک ایلینویز
scope note: توسط دریاچه میشیگان در منتهی الیه شمال شرقی ایلینویز محدود شده است.
broader: ایلینویز
preferred label: Lake County Illinois @en
type: Concept

ایلینویز
preferred label: Illinois @en
type: Concept
narrower: ناحیه لیک ایلینویز