جزیره آنت
scope note: جنوب مجمع‌الجزایر الکساندر. در جزایر آنت. جنوب شرق آلاسکا
broader: مجمع‌الجزایر الکساندر
preferred label: Anette Island @en
type: Concept

مجمع‌الجزایر الکساندر
preferred label: Alexander Archipelago @en
type: Concept
narrower: جزیره آنت