جزایر آلوتین
preferred label: Aleutian Islands @en
type: Concept
narrower: جزیره آمچیتکا

جزیره آمچیتکا
scope note: در مرکز جزایر آلوتین جنوب غرب شبه جزیره آلاسکا
broader: جزایر آلوتین
preferred label: Amchitka Island @en
type: Concept