آلاسکا
preferred label: Alaska @en
type: Concept
narrower: آلاسکای غربی-مرکزی

آلاسکای غربی-مرکزی
scope note: ناحیه مصنوعی بر مبنای اسامی چهارگوش سازمان زمین‌شناسی ایالات متحده شامل جزیره سنت لوئیس
broader: آلاسکا
preferred label: West-Central Alaska @en
type: Concept