فلوریدا
preferred label: Florida @en
type: Concept
narrower: ناحیه لافایت فلوریدا

ناحیه لافایت فلوریدا
scope note: توسط رود سوانی در شمال فلوریدا احاطه شده است.
broader: فلوریدا
preferred label: Lafayette County Florida @en
type: Concept