فلوریدا
preferred label: Florida @en
type: Concept
narrower: ناحیه لیک فلوریدا

ناحیه لیک فلوریدا
scope note: توسط رود سنت‌جونز در مرکز فلوریدا محدود شده است.
broader: فلوریدا
preferred label: Lake County Florida @en
type: Concept