ناحیه ماناتی فلوریدا
scope note: در دهانه خلیج مکزیک و خلیج تامپا در جنوب غرب فلوریدا.
broader: فلوریدا
preferred label: Manatee County Florida @en
type: Concept

فلوریدا
preferred label: Florida @en
type: Concept
narrower: ناحیه ماناتی فلوریدا