فلوریدا
preferred label: Florida @en
type: Concept
narrower: ناحیه ناسائو فلوریدا

ناحیه ناسائو فلوریدا
scope note: در کناره اقیانوس اطلس در منتهاالیه شمال شرقی فلوریدا.
broader: فلوریدا
preferred label: Nassau County Florida @en
type: Concept