ناحیه چارلستون کارولینای جنوبی
preferred label: Charleston County South Carolina @en
type: Concept
narrower: گسل رود آشلی

گسل رود آشلی
scope note: در ناحیه چارلستون، جنوب شرق کارولینای جنوبی
broader: ناحیه چارلستون کارولینای جنوبی
preferred label: Ashley River Fault @en
type: Concept