خلیج انسلو
scope note: مابین کیپ لوکات و کیپ فیر کناره جنوب شرقی ساحل کارولینای شمالی
broader: کارولینای شمالی
preferred label: Onslow Bay @en
type: Concept

کارولینای شمالی
preferred label: North Carolina @en
type: Concept
narrower: خلیج انسلو