کالیفرنیا
preferred label: California @en
type: Concept
narrower: گسل السینور

گسل السینور
scope note: از دماغه ای در شرق لوس آنجلس تا دماغه ای در شرق سان دیه گو گسترش یافته است.
broader: کالیفرنیا
preferred label: Elsinore Fault @en
type: Concept