ناحیه باتلر کالیفرنیا
preferred label: Butte County California @en
type: Concept
narrower: گنبد اورُوویل

گنبد اورُوویل
scope note: سد خاکی سنگریزه‌ای بر رود فیتر که مخزن اورویل در ناحیه بوت شمال مرکز کالیفرنیا را تشکیل میدهد
related: رودخانه فیدر
broader: ناحیه باتلر کالیفرنیا
preferred label: Oroville Dam @en
type: Concept

رودخانه فیدر
preferred label: Feather River @en
type: Concept
related: گنبد اورُوویل