ناحیه سان دیه گو کالیفرنیا
preferred label: San Diego County California @en
type: Concept
narrower: لاجولا کالیفرنیا

لاجولا کالیفرنیا
scope note: شمال غرب بخش سان‌دیه‌گو در استان سان‌دیه‌گو.
broader: ناحیه سان دیه گو کالیفرنیا
preferred label: La Jolla California @en
type: Concept