ونتورا کالیفرنیا
scope note: شهری در شمال غرب لوس آنجلس در جنوب کالیفرنیا
broader: ناحیه ونتورا کالیفرنیا
preferred label: Ventura California @en
type: Concept

ناحیه ونتورا کالیفرنیا
preferred label: Ventura County California @en
type: Concept
narrower: ونتورا کالیفرنیا