ناحیه بالتیمور مریلند
scope note: شهر تقریباً احاطه شده از بالتیمور در شمال مریلند
broader: مریلند
preferred label: Baltimore County Maryland @en
type: Concept

مریلند
preferred label: Maryland @en
type: Concept
narrower: ناحیه بالتیمور مریلند