نیو مادرید میسوری
scope note: شهری در رود می سی سی پی در منتهاالیه جنوب شرقی میسوری.
broader: میسوری
preferred label: New Madrid Missouri @en
type: Concept

میسوری
preferred label: Missouri @en
type: Concept
narrower: نیو مادرید میسوری